Error C2065 Cout Undeclared

3dBuzz c++ mod 3 Error C2065 'level': undeclared identifier FIX

RECOMMENDED: If you have Windows errors then we strongly recommend that you download and run this (Windows) Repair Tool.

Error: 'cout' : undeclared identifier; though I've included. – I am trying to compile the simple program below. But, it's not compiling & gives error: error C2065: 'cout' : undeclared identifier I want to ask you that why this.

Jul 13, 2006  · cout as an undeclared identifier? Visual Studio Languages , Windows Desktop Development >. 1>.ProgRead.cpp(16) : error C2065: ‘cout’ : undeclared.

I’m obviously doing something stupid with ‘cout’ – To my amazement, I can’t get "Hello World" to work as a command line D:VCcpclasscpclass.c(5) : error C2065: ‘cout’ : undeclared identifier D:VCcpclasscpclass.c(5) : error C2297: ‘<<‘ : bad right operand What is the extension of your.

I havent programmed in C++ for about 3 years. Since i started uni actually. Now i gotta implement.

Compiler Errors C2001 through C2099 Compiler Error C2065. The latest version of this topic can be found at Compiler Error C2065. identifier' : undeclared. cout.

Error C2065: 'clrscr' : undeclared identifier MS Visual C++ / MFC Forum. break; } }while(opt!=5); } int menu() { int optn; cout<<"nt1.tAssign a.

Hi, In Visual Studio there are two kinds of *.exe binaries, windows applications and console applications. A console application is has a single console.

I am working on the 'driver' part of my programing assignment and i keep getting this absurd error: error C2065: 'cout' : undeclared identifier I have even tried.

I havent programmed in C++ for about 3 years. Since i started uni actually. Now i gotta implement some stuff for Algorithms and Complexity. I’ve got a vague idea of how to do that but thats not my problem. According to my.

just was working on this code that i need to compile but it gives error messages saying ‘endl’ : undeclared identifier std::cout <<"Here is a very big number :t" << 70000 << endl; std::cout <<"Here is the sum of 8 and 5:t" << 8+5 <<.

Installation Error Sku112 Cab MS Office Error: SKU001.CAB is missing (SOLVED) – Jan 20, 2010. When doing a number of things with Microsoft Office such as reinstalling it, repairing it, installing SP3, etc the error SKU001.CAB is missing may. While specific symptoms vary, some

error C2065: ‘CString’ : undeclared identifier. 0. error C2065: ‘CString’ : undeclared identifier. error C2065: ‘cout’ : undeclared identifier – 21 replies;

Rapiclnt Windows Mobile Error I've setup the latest Windows Mobile 6.1 kit. with "a problem has occurred with RAPICLNT" on the. does not produce this error, but windows mobile 6. Installation Error Sku112 Cab MS Office Error: SKU001.CAB is missing (SOLVED) – Jan 20,

2011年1月15日. 1. syntax error: missing ';' int test, number, test = 12; 2. error c2065: 'cout': undeclared identifier #include <iostream> int main() { cout << “hello,

DLL Tutorial For Beginners – CodeGuru – Nov 21, 2005. a + b );; }; DECLDIR void Function( void ); {; std::cout << "DLL Called!. 19 1 DLLtutorial Error 9 error C2065: 'cout' : undeclared identifier.

Possible Duplicate: C++ Undeclared Identifier (but it is declared?) Im getting the error sprite.h(20): error C2065: ‘Component’ : undeclared identifier when I try to.

Oct 05, 2013  · Hi! I got a code to record sound through a command line application. The code is given below. i keep receiving this error C2065: ‘CALLBACK’ : undeclared.

Oct 26, 2001  · i know i must be making a stupid mistake here. but i just don’t see it. i’m getting the following undeclared identifier errors. but thought i already declared.

17 ago. 2015. Error C2065 'cout': undeclared identifier ConsoleApplication1. Error C2065 disse que o cout não foi declarado, provavelmente por que seu.

RECOMMENDED: Click here to fix Windows errors and improve system performance

This entry was posted in Article. Bookmark the permalink.