Error X11/xlib.h No Such File Or Directory

NS-2.35 install in Ubuntu 14.04

RECOMMENDED: If you have Windows errors then we strongly recommend that you download and run this (Windows) Repair Tool.

Aug 02, 2011  · Hi, I am trying to compile the code. I am getting this following error. Am I missing any package? x86_screen.h:12:22: error: X11/Xlib.h: No such file

The compiler of Netbeans reads: gcc -c -g -Wall -I/usr/openwin/include graphics.c graphics.c:13:22: fatal error: X11/Xlib.h: No such file or directory #include.

No such file or directory pyraf/src/xutil.c:3:22: error: X11/Xlib.h: No such file or directory pyraf/src/xutil.c:4:23: error: X11/Xutil.h: No such file or directory pyraf/src/xutil.c:5:21: error: X11/Xos.h: No such file or directory.

I tried to install NS2.35 in my newly installed ubuntu(I am new to it). I have got following error: In file included from.

Hi, I am trying to compile the code. I am getting this following error. Am I missing any package? x86_screen.h:12:22: error: X11/Xlib.h: No such file

test.cpp:1:22: fatal error: X11/Xlib.h: No such file or directory compilation terminated. you need to install X11 development libraries.

X11/Xlib.h: No such file or directory | Qt Forum – For Odroid XU4 "-qt-xcb" option in configure flashing error **X11/Xlib.h: No such file or directory**

Please look at the error. file or directory screenhack.c:39:28: X11/StringDefs.h: No such file or directory screenhack.c:40:23: X11/Xutil.h: No such file or directory screenhack.c:41:24: X11/keysym.h: No such file or.

test.cpp:1:22: fatal error: X11/Xlib.h: No such file or directory compilation terminated. you need to install X11 development libraries.

Missing deps(?): spack install tr gives fatal error: X11/Xlib.h: No such file or directory #3047. Closed. HenrikBengtsson opened this Issue on Feb 6 · 8 comments.

Mar 20, 2013. The compiler is looking in standard locations for the header file: it doesn't know that you've put it in your home directory. Try this, which sets a.

Oracle Corporation – java2d/pipe/Region.c:30: /home/jars/openjdk/jdk/src/solaris/native/sun/awt/utility/rect.h:31:22: error: X11/Xlib.h: No such file or directory In file included from. /home/jars/openjdk/jdk/src/solaris/native/sun/awt/img_util_md.h:32:.

Mar 14, 2011. sudo apt-get install libxrandr-dev.. for X11/extensions/Xrandr.h. test.cpp:1: 22: fatal error: X11/Xlib.h: No such file or directory compilation.

Freenas Error Code 1 Afp GET /api/v1.0/services/afp/ HTTP / 1.1. The Domain Controller resource represents the configuration settings for FreeNAS Domain. QUIET, FATAL, ERROR, INFO. Free & Open Source unified file and block storage, VM, and Docker system with templates, a self-healing file system, snapshots,

Aug 13, 2009  · I’m trying to install something called morse2led. I believe that it is possible on ubuntu, but seem to be having difficulty. Please forgive my.

X11/Xlib.h: No such file or directory. for tk worked fine ,I am facing problem while using make.I am getting this error. X11/Xlib.h: No such file or directory.

Please forgive my ignorance, but this is the error that I am getting. blinker.c:34: 22: error: X11/Xlib.h: No such file or directory blinker.c:117:.

GitHub is home to over 20 million developers working. generic/tk.h:76:23: fatal error: X11/Xlib.h: No such file or directory, this is because your system has no X11 dev-lib, so we should install them firstly You can use command.

Mar 14, 2011. test.cpp:1:22: fatal error: X11/Xlib.h: No such file or directory.

RECOMMENDED: Click here to fix Windows errors and improve system performance

This entry was posted in Article. Bookmark the permalink.