Visual Studio Error Msb6006 Cmd Exe Exited With Code 1

RECOMMENDED: If you have Windows errors then we strongly recommend that you download and run this (Windows) Repair Tool.

The Robotic Library Has Reported A General Hardware Error Condition Event ID 58053: "Robotic library hardware error. The robotic library has reported a general hardware error condition. Manual intervention, calibration, etc. may be. The Pentagon – The latest prototype the program has produced would allow Maverick to fly with a

Weird error MSB6006: "cmd.exe" exited with code 1 on some packages #1151. Closed. jviotti opened this Issue on Mar 19 · 13 comments.

Mar 6, 2017. It failed to build due to error MSB6006: "cmd.exe" exited with code 255. src -G " Visual Studio 14 2015 Win64" -DENABLE_LIBEVENT=1.

Ca Siteminder Winsock Error 10054 DB:3.99:I Purchased A Computer At Walmart On Oct 17 And Was Told I Would Be Able To Get A Free Windows 7 Upgrade. I Am Now Using Windows Vista.;;. See Microsoft's WinSock Error Codes for more extensive.

Tag: 5): error MSB6006: “cmd.exe” exited with code 1. Building MySQL and MariaDB on Windows using Visual Studio 2012 Express versus Visual Studio.

Getting an error MSB6006: "LC.exe" exited with code -1, I solved this by simply deleting the content of the licenses.licx file. – Uwe Keim Jan 9 '14 at 15:16. Browse other questions tagged visual-studio-2010 build compiler-errors or ask your own question.

error MSB6006 : "cmd.exe" exited with code 3 – Iam migrating my application from vc++ 0.6 to vc++ 2013 , one of the error iam facing is : error MSB6006 : "cmd.exe" exited with code 3. Can anyone guide me through this.

When I try to build VTK on VS 2010, I get this error error MSB6006: "cmd.exe" exited with code 9009. C:Program Files (x86)MSBuildMicrosoft.Cppv4.0Microsoft.

May 17, 2017. This error commonly happens because the default cmake install location requires admin. Run visual studio as Administrator Override the.

General C++ Programming. error MSB6006: "cmd.exe" exited with cod. I am new to c++ and Microsoft Visual Studio. I would appreciate any light you could shed on the situation. I will post the output from the build below.

kinit.exe command-line app to get Kerberos credentials klist.exe command. to the values needed to authenticate against the POP server. Leash DLL timesync code: 1. Use TIMEHOST environment value if defined. 2. Otherwise,

Jul 30, 2015. Cppv4.0V140Microsoft.CppCommon.targets(170,5): error MSB6006: "cmd.exe" exited with code 1. They seem to crash because Visual Studio.

Jul 13, 2016. 1>C:Program Files (x86)MSBuildMicrosoftVisualStudiov14.0TypeScript Microsoft.TypeScript.targets(214,5): error MSB6006: "tsc.exe" exited.

When I try to build VTK on VS 2010, I get this error error MSB6006: "cmd.exe" exited with code 9009.

Error Signing On To Jtagice Mkii At Usb Am bored of the iPhone USB connection. the error of its ways and make amends. It’s the school of tough love. A lot of miles in the Mazda this week, due mostly to the Goodwood Revival over three days. Strange

Windows Server – A block of code is set as follows: Function Multiply-Numbers { Param($FirstNum, $SecNum) Try { Write-Host ($FirstNum * $SecNum) } Catch { Write-Host "Error in function. f ($jenny*10000)) Any command-line input or output is written as.

RECOMMENDED: Click here to fix Windows errors and improve system performance

This entry was posted in Article. Bookmark the permalink.